{"text_format":"1","workbook":"xlsx","n_sheets":2,"sheets":["Treppenlagerliste","Parameter"],"not_rendered":{"charts":0,"images":27,"macros":0,"external_links":0,"defined_names":2,"comments":0,"pivot_tables":0},"unopened":[],"bounds":{"document_bytes":16777216,"sheet_cells":100000,"rows_first":2000,"rows_last":500,"rows_between":2000,"halvings":0,"cell_chars":16384,"cell_head_chars":4096},"cells_cut":0,"cells_raw":0,"read":"whole","date_system":"1900"}

{"sheet":"Treppenlagerliste","index":0,"n_rows":316,"n_cols":19,"rows_kept":316,"cut":false,"hidden":false,"merged":[[70,3,70,4],[72,3,72,4],[75,3,75,4],[260,7,260,18],[3,13,3,19],[248,7,248,18],[251,14,251,15],[251,16,251,18],[252,14,252,15],[252,16,252,18],[254,7,254,18],[257,14,257,15],[257,16,257,18],[258,14,258,15],[258,16,258,18],[236,7,236,18],[239,14,239,15],[239,16,239,18],[240,14,240,15],[240,16,240,18],[242,7,242,18],[245,14,245,15],[245,16,245,18],[246,14,246,15],[246,16,246,18],[227,5,227,12],[227,14,227,15],[227,16,227,18],[228,14,228,15],[228,16,228,18],[230,7,230,18],[233,14,233,15],[233,16,233,18],[234,14,234,15],[234,16,234,18],[214,14,214,15],[214,16,214,18],[215,14,215,15],[215,16,215,18],[216,14,216,15],[216,16,216,18],[217,7,217,18],[220,3,224,4],[220,14,220,15],[220,16,220,18],[221,7,221,8],[221,10,221,11],[221,14,221,15],[221,16,221,18],[222,7,222,8],[222,10,222,11],[222,14,222,15],[222,16,222,18],[223,7,223,8],[223,10,223,11],[223,14,223,15],[223,16,223,18],[224,7,224,18],[204,7,204,18],[207,14,207,15],[207,16,207,18],[208,7,208,8],[208,10,208,11],[208,14,208,15],[208,16,208,18],[210,7,210,18],[213,14,213,15],[213,16,213,18],[195,14,195,15],[195,16,197,18],[196,14,196,15],[197,14,197,15],[198,7,198,18],[201,14,201,15],[201,16,201,18],[202,7,202,8],[202,10,202,11],[202,14,202,15],[202,16,202,18],[187,14,187,15],[187,16,190,18],[188,14,188,15],[189,14,189,15],[190,14,190,15],[191,7,191,18],[193,14,193,18],[194,14,194,15],[194,16,194,18],[179,14,179,15],[179,16,182,18],[180,14,180,15],[181,14,181,15],[182,14,182,15],[183,7,183,18],[185,14,185,18],[186,14,186,15],[186,16,186,18],[171,14,171,15],[171,16,174,18],[172,14,172,15],[173,14,173,15],[174,14,174,15],[175,7,175,18],[177,14,177,18],[178,14,178,15],[178,16,178,18],[162,16,162,18],[163,16,163,18],[164,16,164,18],[165,16,165,18],[166,3,167,4],[166,7,166,18],[169,14,169,18],[170,14,170,15],[170,16,170,18],[149,3,150,4],[149,7,149,18],[152,14,152,18],[153,3,159,4],[153,14,153,15],[153,16,153,18],[154,14,154,15],[154,16,158,18],[155,14,155,15],[156,12,157,12],[156,13,157,13],[156,14,157,15],[158,14,158,15],[159,7,159,18],[144,14,144,15],[144,16,144,18],[145,14,145,15],[145,16,145,18],[146,14,146,15],[146,16,146,18],[147,14,147,15],[147,16,147,18],[148,14,148,15],[148,16,148,18],[134,3,141,4],[134,14,134,15],[134,16,140,18],[135,14,135,15],[136,12,137,12],[136,13,137,13],[136,14,137,15],[138,14,138,15],[139,14,139,15],[140,14,140,15],[141,7,141,18],[125,16,125,18],[126,16,126,18],[127,16,127,18],[128,16,128,18],[129,3,130,4],[129,7,129,18],[132,14,132,18],[133,14,133,15],[133,16,133,18],[115,14,115,18],[116,14,116,15],[116,16,116,18],[117,3,122,4],[117,14,117,15],[117,16,121,18],[118,14,118,15],[119,14,120,15],[121,14,121,15],[122,7,122,18],[108,14,108,15],[108,16,108,18],[109,14,109,15],[109,16,109,18],[110,14,110,15],[110,16,110,18],[111,14,111,15],[111,16,111,18],[112,3,113,4],[112,7,112,18],[98,3,105,4],[98,14,98,15],[98,16,104,18],[99,14,99,15],[100,12,101,12],[100,13,101,13],[100,14,101,15],[102,14,102,15],[103,14,103,15],[104,14,104,15],[105,7,105,18],[92,3,94,4],[92,14,92,15],[92,16,92,18],[93,14,93,15],[93,16,93,18],[94,7,94,18],[96,14,96,18],[97,14,97,15],[97,16,97,18],[85,3,89,4],[85,14,85,15],[85,16,85,18],[86,14,86,15],[86,16,86,18],[87,14,87,15],[87,16,87,18],[88,14,88,15],[88,16,88,18],[89,7,89,18],[80,5,80,8],[80,9,80,15],[80,16,80,18],[81,3,81,4],[81,5,81,8],[81,9,81,15],[81,16,81,18],[82,3,82,4],[82,5,82,8],[82,9,82,15],[82,16,82,18],[59,14,59,15],[61,14,61,15],[36,14,36,15],[24,16,24,17],[76,16,76,18],[77,3,77,4],[77,5,77,8],[77,9,77,15],[77,16,77,18],[37,14,37,15],[34,16,34,17],[35,16,35,17],[36,16,36,17],[37,16,37,17],[38,16,38,17],[39,16,39,17],[40,16,40,17],[41,16,41,17],[42,16,42,17],[54,16,54,17],[55,16,55,17],[56,16,56,17],[57,16,57,17],[58,16,58,17],[67,1,68,1],[25,6,31,6],[25,7,31,7],[25,4,31,4],[25,5,31,5],[25,3,31,3],[4,1,30,1],[0,1,1,1],[28,20,57,28],[62,14,62,15],[63,14,63,15],[64,14,64,15],[65,14,65,15],[66,14,66,15],[50,14,50,15],[51,14,51,15],[52,14,52,15],[53,14,53,15],[54,14,54,15],[55,14,55,15],[58,14,58,15],[60,14,60,15],[41,14,41,15],[42,14,42,15],[10,3,10,4],[24,14,24,15],[34,14,34,15],[35,14,35,15],[56,14,56,15],[57,14,57,15],[46,14,46,15],[47,14,47,15],[48,14,48,15],[49,14,49,15],[38,14,38,15],[39,14,39,15],[40,14,40,15],[11,3,11,4],[12,3,12,4],[13,3,13,4],[10,5,10,7],[10,8,10,9],[25,8,31,8],[29,11,31,11],[29,12,31,12],[43,14,43,15],[44,14,44,15],[45,14,45,15],[1,5,1,7],[3,3,3,4],[4,3,4,4],[5,3,5,4],[6,3,6,4],[7,3,7,4],[10,14,10,17],[9,14,9,17],[11,5,11,9],[7,5,7,9],[8,5,8,9],[9,5,9,9],[8,13,8,19],[7,13,7,19],[7,10,7,12],[8,10,8,12],[4,5,4,19],[1,8,1,14],[2,8,2,14],[5,5,5,19],[6,5,6,19],[1,3,2,4],[3,5,3,12],[11,13,11,19],[2,1,3,1],[25,18,31,19],[25,16,31,17],[32,16,32,17],[33,16,33,17],[32,18,32,19],[33,18,33,19],[24,2,30,2],[12,5,12,9],[13,5,13,9],[13,13,13,19],[12,13,12,19],[11,10,11,12],[12,10,12,12],[13,10,13,12],[29,9,31,9],[29,10,31,10],[25,9,28,12],[25,13,31,13],[25,14,31,15],[32,14,32,15],[33,14,33,15],[8,3,8,4],[9,3,9,4],[59,16,59,17],[60,16,60,17],[43,16,43,17],[44,16,44,17],[45,16,45,17],[46,16,46,17],[47,16,47,17],[48,16,48,17],[49,16,49,17],[50,16,50,17],[51,16,51,17],[45,18,45,19],[46,18,46,19],[47,18,47,19],[48,18,48,19],[49,18,49,19],[50,18,50,19],[51,18,51,19],[52,16,52,17],[53,16,53,17],[36,18,36,19],[37,18,37,19],[38,18,38,19],[39,18,39,19],[40,18,40,19],[41,18,41,19],[42,18,42,19],[43,18,43,19],[44,18,44,19],[61,18,61,19],[62,18,62,19],[63,18,63,19],[64,18,64,19],[65,18,65,19],[66,16,66,17],[16,14,16,15],[52,18,52,19],[53,18,53,19],[54,18,54,19],[55,18,55,19],[56,18,56,19],[57,18,57,19],[58,18,58,19],[59,18,59,19],[60,18,60,19],[61,16,61,17],[62,16,62,17],[63,16,63,17],[64,16,64,17],[65,16,65,17],[66,18,66,19],[34,18,34,19],[35,18,35,19],[71,0,71,1],[263,14,263,15],[271,2,277,2],[271,14,271,15],[271,16,271,17],[272,3,278,3],[272,4,278,4],[272,5,278,5],[272,6,278,6],[272,7,278,7],[272,8,278,8],[272,9,275,12],[272,13,278,13],[272,14,278,15],[272,16,278,17],[78,3,78,4],[78,5,78,8],[78,9,78,15],[78,16,78,18],[79,3,79,4],[79,5,79,8],[79,9,79,15],[79,16,79,18],[80,3,80,4],[272,18,278,19],[276,9,278,9],[276,10,278,10],[276,11,278,11],[276,12,278,12],[279,14,279,15],[279,16,279,17],[279,18,279,19],[280,14,280,15],[280,16,280,17],[280,18,280,19],[281,14,281,15],[281,16,281,17],[281,18,281,19],[282,14,282,15],[282,16,282,17],[282,18,282,19],[283,14,283,15],[283,16,283,17],[283,18,283,19],[284,14,284,15],[284,16,284,17],[284,18,284,19],[285,14,285,15],[285,16,285,17],[285,18,285,19],[286,14,286,15],[286,16,286,17],[286,18,286,19],[287,14,287,15],[287,16,287,17],[287,18,287,19],[288,14,288,15],[288,16,288,17],[288,18,288,19],[289,14,289,15],[289,16,289,17],[289,18,289,19],[290,14,290,15],[290,16,290,17],[290,18,290,19],[291,14,291,15],[291,16,291,17],[291,18,291,19],[292,14,292,15],[292,16,292,17],[292,18,292,19],[293,14,293,15],[293,16,293,17],[293,18,293,19],[294,14,294,15],[294,16,294,17],[294,18,294,19],[295,14,295,15],[295,16,295,17],[295,18,295,19],[296,14,296,15],[296,16,296,17],[296,18,296,19],[297,14,297,15],[297,16,297,17],[297,18,297,19],[298,14,298,15],[298,16,298,17],[298,18,298,19],[299,14,299,15],[299,16,299,17],[299,18,299,19],[300,14,300,15],[300,16,300,17],[300,18,300,19],[301,14,301,15],[301,16,301,17],[301,18,301,19],[302,14,302,15],[302,16,302,17],[302,18,302,19],[303,14,303,15],[303,16,303,17],[303,18,303,19],[304,14,304,15],[304,16,304,17],[304,18,304,19],[305,14,305,15],[305,16,305,17],[305,18,305,19],[306,14,306,15],[306,16,306,17],[306,18,306,19],[307,14,307,15],[307,16,307,17],[307,18,307,19],[308,14,308,15],[308,16,308,17],[308,18,308,19],[309,14,309,15],[309,16,309,17],[309,18,309,19],[310,14,310,15],[310,16,310,17],[310,18,310,19],[314,1,315,1],[311,14,311,15],[311,16,311,17],[311,18,311,19],[312,14,312,15],[312,16,312,17],[312,18,312,19],[313,14,313,15],[313,16,313,17],[313,18,313,19]]}
[null,"Informationen zum Umgang mit diesem Dokument"]
[null,null,null,"Bestellung\nBestellliste gültig ab: 15.05.2023",null,"durch Firma "]
[null,"WICHTIG - Bitte verschieben Sie keine Zellen und vermeiden Sie sowohl spaltenübergreifendes Kopieren/Einfügen als auch Ausschneiden/Einfügen.",null,null,null,null,null,null,{"$f":"\"max. \"&Parameter!C15&\" Zeichen für Firmenname, aktuell: \"&LEN(I2)&IF(LEN(I2)>Parameter!C15, \" | Bitte kürzen.\", \"\")","v":"max. 20 Zeichen für Firmenname, aktuell: 0"}]
[null,null,null,"Bauobjekt",null,null,null,null,null,null,null,null,null,{"$f":"\"max. \"&Parameter!C14&\" Zeichen für Bauobjekt, aktuell: \"&LEN(F4)&IF(LEN(F4)>Parameter!C14, \" | Bitte kürzen.\", \"\")","v":"max. 35 Zeichen für Bauobjekt, aktuell: 0"}]
[null,null,null,"Lieferadresse   der Baustelle"]
[null,null,null,"Lieferadresse   vom Werk "]
[null,null,null,"Bauunternehmer"]
[null,null,null,"Polier",null,null,null,null,null,null,"Mobil-Nr. Polier"]
[null,null,null,"Besteller",null,null,null,null,null,null,"Tel.-Nr. Besteller"]
[null,null,null,"Ingenieur"]
[null,null,null,"Anlieferstelle/Lieferdatum",null,"Bitte auswählen!"]
[null,null,null,"Ausgefüllt durch",null,null,null,null,null,null,"Datum",null,null,{"$f":"TODAY()","v":"2023-10-26"}]
[null,null,null,"Plan.- Materialliste-Nr. ",null,null,null,null,null,null,"HBT-ISOL Objekt Nr.",null,null,"wird von HBT ausgefüllt"]
[null,null,null,"Kommission.- Auftrag Nr.  ",null,null,null,null,null,null,"Auftrags-Nr.",null,null,"wird von HBT ausgefüllt"]
[]
[null,null,null,"ISOTREPP"]
[null,null,null,null,"F-Form",null,"L-Form",null,null,null,"Z-Form",null,null,null,"U-Form"]
[]
[]
[]
[]
[]
[]
[]
[null,null,"Beschreibungslänge"]
[null,null,null,"#",{"$f":"\"Beschreibung (Freitext)                                       (max. \"&Parameter!$C$2&\" Zeichen)\"","v":"Beschreibung (Freitext)                                       (max. 25 Zeichen)"}," \nAntritt \nAustritt\nPodest \nWand","Lagertyp                "," Form (F/L/Z/U)","Trittschallminderung ΔL*W  (28 / 32 dB)","Abmessungen mm",null,null,null," Bestell-Menge \n(Stk.)","Falls A > 600mm                         4-Punkt-Lager                        ",null,"Pläne mitsenden",null,"Wegfall Anschlagspunkte"]
[]
[]
[]
[null,null,null,null,null,null,null,null,null,"A","B","C","Länge"]
{"$rows_left_out":287}
{"sheet":"Parameter","index":1,"n_rows":15,"n_cols":13,"rows_kept":15,"cut":false,"hidden":true,"merged":[]}
[]
[null,"Max. Zeichen bei Beschreibung:",25]
[null,"Antritt/Antritt","Antritt","Austritt","Podest","Wand"," "]
[null,"Lagertyp",1500,2000,3000,4000,5000,6000,8000,10000,12000,14000,16000]
[null,"Form","F","L","Z","U"]
[null,"Trittschallminderung",28,32,36]
[null,"A","F/U-Min:",70,"F/U-Max:",2000,"L/Z-Min:",70,"L/Z-Max:",600]
[null,"B","Min:",30,"Max:",600]
[null,"C","Min:",30,"Max:",600]
[null,"Länge","Min:",600,"Max:",1500]
[]
[]
[]
[null,"Max. Zeichen bei Bauobjekt",35]
[null,"Max. Zeichen bei Firmenname",20]